Target
RAC-alpha serine/threonine-protein kinase
Ligand
BDBM32355
Substrate
Meas. Tech.
AKT counterscreen of confirmed PKD inhibitors-57K library
IC50
>100000±n/a nM
Citation
 PubChem, PC AKT counterscreen of confirmed PKD inhibitors-57K library PubChem Bioassay (2008)[AID] 
Target
Name:
RAC-alpha serine/threonine-protein kinase
Synonyms:
AKT phosphorylation (p-AKT) AKT1/PPP1CA C-AKT PKB alpha Protein kinase B Protein kinase B (Akt 1) Protein kinase B alpha Proto-oncogene Akt (Akt1) Proto-oncogene c-Akt (AKT1) RAC-PK-alpha RAC-alpha serine/threonine-protein kinase (AKT1) | RAC-alpha serine/threonine-protein kinase (pAKT)
Type:
Enzyme
Mol. Mass.:
55681.25
Organism:
Homo sapiens (Human)
Description:
P31749
Residue:
480
  
Inhibitor
Name:
BDBM32355
Synonyms:
MLS000730065 N-cyclopentyl-3-(4-methoxybenzyl)-2,4-dioxo-1,2,3,4-tetrahydroquinazoline-7-carboxamide N-cyclopentyl-3-[(4-methoxyphenyl)methyl]-2,4-dioxo-1H-quinazoline-7-carboxamide cid_16195425
Type:
Small organic molecule
Emp. Form.:
C22H23N3O4
Mol. Mass.:
393.4357
SMILES:
COc1ccc(Cn2c(=O)[nH]c3cc(ccc3c2=O)C(=O)NC2CCCC2)cc1
: