Target
Cyclin-dependent kinase 7
Ligand
BDBM32348
Substrate
Meas. Tech.
CDK7 counterscreen of confirmed PKD inhibitors-57K library addition
IC50
8222.176091±n/a nM
Citation
 PubChem, PC CDK7 counterscreen of confirmed PKD inhibitors-57K library addition PubChem Bioassay (2008)[AID] 
Target
Name:
Cyclin-dependent kinase 7
Synonyms:
39 kDa protein kinase CAK1 CDK-activating kinase 1 (CAK) CDK7_HUMAN Cell division protein kinase 7 Cyclin-dependent kinase 7 (CDK7/cyclin H) P39 Mo15 TFIIH basal transcription factor complex kinase subunit
Type:
Enzyme Subunit
Mol. Mass.:
39047.01
Organism:
Homo sapiens (Human)
Description:
Residue:
346
  
Inhibitor
Name:
BDBM32348
Synonyms:
6-(2-methyl-2,3-dihydro-1H-indol-1-yl)-5-nitro-4-pyrimidinamine 6-(2-methyl-2,3-dihydroindol-1-yl)-5-nitro-pyrimidin-4-amine MLS000665974 [6-(2-methylindolin-1-yl)-5-nitro-pyrimidin-4-yl]amine | cid_2958734
Type:
Small organic molecule
Emp. Form.:
C13H13N5O2
Mol. Mass.:
271.2746
SMILES:
CC1Cc2ccccc2N1c1ncnc(N)c1[N+]([O-])=O
: