Target
DNA-directed RNA polymerase subunit beta
Ligand
BDBM43293
Substrate
Meas. Tech.
RNA polymerase SAR
IC50
>50000±n/a nM
Citation
 PubChem, PC RNA polymerase SAR PubChem Bioassay (2008)[AID] 
Target
Name:
DNA-directed RNA polymerase subunit beta
Synonyms:
RNA polymerase beta subunit (EC 2.7.7.6)
Type:
Enzyme Catalytic Domain
Mol. Mass.:
150595.80
Organism:
Escherichia coli
Description:
A0A0E2LB94
Residue:
1342
  
Inhibitor
Name:
BDBM43293
Synonyms:
N-(4-cyano-1-naphthalenyl)-2,5-dimethoxybenzenesulfonamide N-(4-cyanonaphthalen-1-yl)-2,5-dimethoxy-benzenesulfonamide PC-0596521 cid_16738581
Type:
Small organic molecule
Emp. Form.:
C19H16N2O4S
Mol. Mass.:
368.406
SMILES:
COc1ccc(OC)c(c1)S(=O)(=O)Nc1ccc(C#N)c2ccccc12
: