Target
DNA-directed RNA polymerase subunit beta
Ligand
BDBM43307
Substrate
Meas. Tech.
RNA polymerase SAR
IC50
28446±n/a nM
Citation
 PubChem, PC RNA polymerase SAR PubChem Bioassay (2008)[AID] 
Target
Name:
DNA-directed RNA polymerase subunit beta
Synonyms:
RNA polymerase beta subunit (EC 2.7.7.6)
Type:
Enzyme Catalytic Domain
Mol. Mass.:
150595.80
Organism:
Escherichia coli
Description:
A0A0E2LB94
Residue:
1342
  
Inhibitor
Name:
BDBM43307
Synonyms:
4-methyl-N-(4-oxidanylnaphthalen-1-yl)benzenesulfonamide N-(4-hydroxy-1-naphthyl)-4-methyl-benzenesulfonamide PC-0599222 cid_832572
Type:
Small organic molecule
Emp. Form.:
C17H15NO3S
Mol. Mass.:
313.371
SMILES:
Cc1ccc(cc1)S(=O)(=O)Nc1ccc(O)c2ccccc12
: