Target
Gag-Pol polyprotein [588-1027]/[588-1147]
Ligand
BDBM2661
Substrate
poly(rA)600:oligo(dT)10
Meas. Tech.
HIV-1 RT Assay
IC50
190±n/a nM
Citation
 Romero, DLOlmsted, RAPoel, TJMorge, RABiles, CKeiser, BJKopta, LAFriis, JMHosley, JDStefanski, KJWishka, DGEvans, DBMorris, JStehle, RGSharma, SKYagi, YVoorman, RLAdams, WJTarpley, WGThomas, RC Targeting delavirdine/atevirdine resistant HIV-1: identification of (alkylamino)piperidine-containing bis(heteroaryl)piperazines as broad spectrum HIV-1 reverse transcriptase inhibitors. J Med Chem 39:3769-89 (1996)  
Target
Name:
Gag-Pol polyprotein [588-1027]/[588-1147]
Synonyms:
EC: 2.7.7.49 | HIV-1 Reverse Transcriptase
Type:
Protein Complex
Mol. Mass.:
115684
Description:
Components:
This complex has 2 components.
Component 1
Name:
Gag-Pol polyprotein [588-1147]
Synonyms:
HIV-1 Reverse Transcriptase Chain A gag-pol
Type:
Enzyme Subunit
Mol. Mass.:
64486.41
Organism:
Human immunodeficiency virus type 1
Description:
P04585[588-1147]
Residue:
560
  
Component 2
Name:
Gag-Pol polyprotein [588-1027]
Synonyms:
HIV-1 Reverse Transcriptase Chain B gag-pol
Type:
Enzyme Subunit
Mol. Mass.:
51337.13
Organism:
Human immunodeficiency virus type 1
Description:
P04585[588-1027]
Residue:
440
  
Inhibitor
Name:
BDBM2661
Synonyms:
(Alkylamino)piperidine BHAP Analog 29 | 4-methyl-N-{2-[(4-{[3-(propan-2-ylamino)pyridin-2-yl](propyl)amino}piperidin-1-yl)carbonyl]-1H-indol-5-yl}piperazine-1-carboxamide
Type:
Small organic molecule
Emp. Form.:
C31H44N8O2
Mol. Mass.:
560.7335
SMILES:
CCCN(C1CCN(CC1)C(=O)c1cc2cc(NC(=O)N3CCN(C)CC3)ccc2[nH]1)c1ncccc1NC(C)C
:
Substrate
Name:
poly(rA)600:oligo(dT)10
Synonyms:
Type:
RNA-DNA duplex
Mol. Mass.:
358.43
Organism:
Description:
The incorporation of thymidine triphosphate with [methyl-3H]thymidine 5 -triphosphate onto a poly(rA)600:oligo(dT)10 template:primer.
Residue:
3
NA