Target
Gag-Pol polyprotein [588-1127,Y768C]/[588-1147,Y768C]
Ligand
BDBM1962
Substrate
poly(rA)600:oligo(dT)10
Meas. Tech.
HIV-1 RT Assay
IC50
480±n/a nM
Citation
 Romero, DLOlmsted, RAPoel, TJMorge, RABiles, CKeiser, BJKopta, LAFriis, JMHosley, JDStefanski, KJWishka, DGEvans, DBMorris, JStehle, RGSharma, SKYagi, YVoorman, RLAdams, WJTarpley, WGThomas, RC Targeting delavirdine/atevirdine resistant HIV-1: identification of (alkylamino)piperidine-containing bis(heteroaryl)piperazines as broad spectrum HIV-1 reverse transcriptase inhibitors. J Med Chem 39:3769-89 (1996)  
Target
Name:
Gag-Pol polyprotein [588-1127,Y768C]/[588-1147,Y768C]
Synonyms:
EC: 2.7.7.49 | HIV-1 Reverse Transcriptase Mutant (Y181C)
Type:
Protein Complex
Mol. Mass.:
Description:
Components:
This complex has 2 components.
Component 1
Name:
Gag-Pol polyprotein [588-1147,Y768C]
Synonyms:
HIV-1 Reverse Transcriptase Mutant (Y181C) Chain A gag-pol
Type:
Enzyme Subunit
Mol. Mass.:
64426.38
Organism:
Human immunodeficiency virus type 1
Description:
P04585[588-1147,Y768C]
Residue:
560
  
Component 2
Name:
Gag-Pol polyprotein [588-1127,Y768C]
Synonyms:
HIV-1 Reverse Transcriptase Mutant (Y181C) Chain B gag-pol
Type:
Enzyme Subunit
Mol. Mass.:
51277.10
Organism:
Human immunodeficiency virus type 1
Description:
P04585[588-1127,Y768C]
Residue:
440
  
Inhibitor
Name:
BDBM1962
Synonyms:
(Alkylamino)piperidine BHAP Analog 18 | N-{2-[(4-{ethyl[3-(ethylamino)pyridin-2-yl]amino}piperidin-1-yl)carbonyl]-1H-indol-5-yl}ethane-1-sulfonamide
Type:
Small organic molecule
Emp. Form.:
C25H34N6O3S
Mol. Mass.:
498.641
SMILES:
CCNc1cccnc1N(CC)C1CCN(CC1)C(=O)c1cc2cc(NS(=O)(=O)CC)ccc2[nH]1
:
Substrate
Name:
poly(rA)600:oligo(dT)10
Synonyms:
Type:
RNA-DNA duplex
Mol. Mass.:
358.43
Organism:
Description:
The incorporation of thymidine triphosphate with [methyl-3H]thymidine 5 -triphosphate onto a poly(rA)600:oligo(dT)10 template:primer.
Residue:
3
NA