Target
E3 ubiquitin-protein ligase Mdm2
Ligand
BDBM43363
Substrate
Meas. Tech.
E3 Ligase dose-response_384
EC50
2420±n/a nM
Citation
 PubChem, PC E3 Ligase dose-response_384 PubChem Bioassay (2008)[AID] 
Target
Name:
E3 ubiquitin-protein ligase Mdm2
Synonyms:
Double minute 2 protein E3 ubiquitin-protein ligase Mdm2 (p53-binding protein Mdm2) Human Double Minute 2 (HDM2) MDM2-MDMX p53-Binding Protein MDM2 | p53-binding protein
Type:
Oncoprotein
Mol. Mass.:
55196.54
Organism:
Homo sapiens (Human)
Description:
Q00987
Residue:
491
  
Inhibitor
Name:
BDBM43363
Synonyms:
2,5-bis(chloranyl)-3-piperidin-1-yl-6-(2-piperidin-1-yl-1,3-thiazol-5-yl)cyclohexa-2,5-diene-1,4-dione 2,5-dichloro-3-(1-piperidinyl)-6-[2-(1-piperidinyl)-5-thiazolyl]cyclohexa-2,5-diene-1,4-dione 2,5-dichloro-3-piperidino-6-(2-piperidinothiazol-5-yl)-p-benzoquinone SMR000115104 | cid_406171
Type:
Small organic molecule
Emp. Form.:
C19H21Cl2N3O2S
Mol. Mass.:
426.36
SMILES:
ClC1=C(N2CCCCC2)C(=O)C(Cl)=C(c2cnc(s2)N2CCCCC2)C1=O
: