Target
E3 ubiquitin-protein ligase Mdm2
Ligand
BDBM43385
Substrate
Meas. Tech.
E3 Ligase dose-response_384
EC50
8840±n/a nM
Citation
 PubChem, PC E3 Ligase dose-response_384 PubChem Bioassay (2008)[AID] 
Target
Name:
E3 ubiquitin-protein ligase Mdm2
Synonyms:
Double minute 2 protein E3 ubiquitin-protein ligase Mdm2 (p53-binding protein Mdm2) Human Double Minute 2 (HDM2) MDM2-MDMX p53-Binding Protein MDM2 | p53-binding protein
Type:
Oncoprotein
Mol. Mass.:
55196.54
Organism:
Homo sapiens (Human)
Description:
Q00987
Residue:
491
  
Inhibitor
Name:
BDBM43385
Synonyms:
MLS000546243 N-(4-chlorophenyl)-3-nitro-4-(1H-pyrazol-1-yl)benzenecarboxamide N-(4-chlorophenyl)-3-nitro-4-pyrazol-1-ylbenzamide cid_3778594
Type:
Small organic molecule
Emp. Form.:
C16H11ClN4O3
Mol. Mass.:
342.737
SMILES:
[O-][N+](=O)c1cc(ccc1-n1cccn1)C(=O)Nc1ccc(Cl)cc1
: