Target
E3 ubiquitin-protein ligase Mdm2
Ligand
BDBM43415
Substrate
Meas. Tech.
E3 Ligase dose-response_384
EC50
8930±n/a nM
Citation
 PubChem, PC E3 Ligase dose-response_384 PubChem Bioassay (2008)[AID] 
Target
Name:
E3 ubiquitin-protein ligase Mdm2
Synonyms:
Double minute 2 protein E3 ubiquitin-protein ligase Mdm2 (p53-binding protein Mdm2) Human Double Minute 2 (HDM2) MDM2-MDMX p53-Binding Protein MDM2 | p53-binding protein
Type:
Oncoprotein
Mol. Mass.:
55196.54
Organism:
Homo sapiens (Human)
Description:
Q00987
Residue:
491
  
Inhibitor
Name:
BDBM43415
Synonyms:
MLS000334873 N-(2-methylphenyl)-5-(oxan-2-ylmethylsulfanyl)-1,3,4-thiadiazol-2-amine cid_3977504 | o-tolyl-[5-(tetrahydropyran-2-ylmethylthio)-1,3,4-thiadiazol-2-yl]amine
Type:
Small organic molecule
Emp. Form.:
C15H19N3OS2
Mol. Mass.:
321.461
SMILES:
Cc1ccccc1Nc1nnc(SCC2CCCCO2)s1
: