Target
E3 ubiquitin-protein ligase Mdm2
Ligand
BDBM43436
Substrate
Meas. Tech.
E3 Ligase dose-response_384
EC50
9390±n/a nM
Citation
 PubChem, PC E3 Ligase dose-response_384 PubChem Bioassay (2008)[AID] 
Target
Name:
E3 ubiquitin-protein ligase Mdm2
Synonyms:
Double minute 2 protein E3 ubiquitin-protein ligase Mdm2 (p53-binding protein Mdm2) Human Double Minute 2 (HDM2) MDM2-MDMX p53-Binding Protein MDM2 | p53-binding protein
Type:
Oncoprotein
Mol. Mass.:
55196.54
Organism:
Homo sapiens (Human)
Description:
Q00987
Residue:
491
  
Inhibitor
Name:
BDBM43436
Synonyms:
MLS000680088 N-[4-[[2-(3-pyridylmethylthio)-2-imidazolin-1-yl]sulfonyl]phenyl]acetamide N-[4-[[2-(pyridin-3-ylmethylsulfanyl)-4,5-dihydroimidazol-1-yl]sulfonyl]phenyl]ethanamide cid_2148817
Type:
Small organic molecule
Emp. Form.:
C17H18N4O3S2
Mol. Mass.:
390.48
SMILES:
CC(=O)Nc1ccc(cc1)S(=O)(=O)N1CCN=C1SCc1cccnc1
: