Target
Signal transducer and activator of transcription 1-alpha/beta
Ligand
BDBM43506
Substrate
Meas. Tech.
Dose response cell-based assay to measure STAT1 inhibition
IC50
10160±n/a nM
Citation
 PubChem, PC Dose response cell-based assay to measure STAT1 inhibition PubChem Bioassay (2008)[AID] 
Target
Name:
Signal transducer and activator of transcription 1-alpha/beta
Synonyms:
STAT1 Signal transducer and activator of transcription 1-alpha/beta Transcription factor ISGF-3 components p91/p84 | signal transducer and activator of transcription 1 isoform alpha
Type:
Cytosolic Transcription Factor
Mol. Mass.:
87327.69
Organism:
Homo sapiens (Human)
Description:
Stat1 was expressed in sf9 cells from a baculovirus encoding the recombinant proteins. Stat1 dimer binds to DNA.
Residue:
750
  
Inhibitor
Name:
BDBM43506
Synonyms:
3-[4-phenyl-6-(trifluoromethyl)pyrimidin-2-yl]sulfonylpropionic acid ethyl ester MLS000051020 cid_2219262 ethyl 3-{[4-phenyl-6-(trifluoromethyl)-2-pyrimidinyl]sulfonyl}propanoate
Type:
Small organic molecule
Emp. Form.:
C16H15F3N2O4S
Mol. Mass.:
388.362
SMILES:
CCOC(=O)CCS(=O)(=O)c1nc(cc(n1)C(F)(F)F)-c1ccccc1
: