Target
Signal transducer and activator of transcription 1-alpha/beta
Ligand
BDBM43521
Substrate
Meas. Tech.
Dose response cell-based assay to measure STAT1 inhibition
IC50
7874±n/a nM
Citation
 PubChem, PC Dose response cell-based assay to measure STAT1 inhibition PubChem Bioassay (2008)[AID] 
Target
Name:
Signal transducer and activator of transcription 1-alpha/beta
Synonyms:
STAT1 Signal transducer and activator of transcription 1-alpha/beta Transcription factor ISGF-3 components p91/p84 | signal transducer and activator of transcription 1 isoform alpha
Type:
Cytosolic Transcription Factor
Mol. Mass.:
87327.69
Organism:
Homo sapiens (Human)
Description:
Stat1 was expressed in sf9 cells from a baculovirus encoding the recombinant proteins. Stat1 dimer binds to DNA.
Residue:
750
  
Inhibitor
Name:
BDBM43521
Synonyms:
MLS000394345 N-(4-fluorophenyl)-2-[4-(4-methylphenyl)sulfonylpiperazin-1-yl]-2-phenyl-ethanamide N-(4-fluorophenyl)-2-phenyl-2-(4-tosylpiperazino)acetamide cid_15945370
Type:
Small organic molecule
Emp. Form.:
C25H26FN3O3S
Mol. Mass.:
467.556
SMILES:
Cc1ccc(cc1)S(=O)(=O)N1CCN(CC1)C(C(=O)Nc1ccc(F)cc1)c1ccccc1
: