Target
Signal transducer and activator of transcription 3 [702-738,740-752]
Ligand
BDBM43568
Substrate
Meas. Tech.
Dose response cell-based assay to measure STAT3 activation
IC50
16970±n/a nM
Citation
 PubChem, PC Dose response cell-based assay to measure STAT3 activation PubChem Bioassay (2008)[AID] 
Target
Name:
Signal transducer and activator of transcription 3 [702-738,740-752]
Synonyms:
APRF STAT3_HUMAN
Type:
Enzyme Catalytic Domain
Mol. Mass.:
5263.93
Organism:
Homo sapiens (Human)
Description:
gi_13272532
Residue:
50
  
Inhibitor
Name:
BDBM43568
Synonyms:
MLS000090510 N-[2-(1H-indol-3-ylthio)ethyl]propanamide SMR000025114 | cid_2068185
Type:
Small organic molecule
Emp. Form.:
C13H16N2OS
Mol. Mass.:
248.344
SMILES:
CCC(=O)NCCSc1c[nH]c2ccccc12
: