Target
Signal transducer and activator of transcription 1-alpha/beta
Ligand
BDBM43620
Substrate
Meas. Tech.
Dose response counterscreen assay for STAT3 activators: cell-based high throughput assay to measure STAT1 activation
EC50
>55700±n/a nM
Citation
 PubChem, PC Dose response counterscreen assay for STAT3 activators: cell-based high throughput assay to measure STAT1 activation PubChem Bioassay (2008)[AID] 
Target
Name:
Signal transducer and activator of transcription 1-alpha/beta
Synonyms:
STAT1 Signal transducer and activator of transcription 1-alpha/beta Transcription factor ISGF-3 components p91/p84 | signal transducer and activator of transcription 1 isoform alpha
Type:
Cytosolic Transcription Factor
Mol. Mass.:
87327.69
Organism:
Homo sapiens (Human)
Description:
Stat1 was expressed in sf9 cells from a baculovirus encoding the recombinant proteins. Stat1 dimer binds to DNA.
Residue:
750
  
Inhibitor
Name:
BDBM43620
Synonyms:
(2E)-2-(1,3-benzothiazol-2-yl)-2-(2-ketoindolin-3-ylidene)acetonitrile (2E)-2-(1,3-benzothiazol-2-yl)-2-(2-oxo-1H-indol-3-ylidene)acetonitrile SMR000264930 | cid_5779525
Type:
Small organic molecule
Emp. Form.:
C17H9N3OS
Mol. Mass.:
303.338
SMILES:
O=C1Nc2ccccc2\C1=C(\C#N)c1nc2ccccc2s1
: