Target
Signal transducer and activator of transcription 1-alpha/beta
Ligand
BDBM43627
Substrate
Meas. Tech.
Dose response counterscreen assay for STAT3 activators: cell-based high throughput assay to measure STAT1 activation
EC50
>55700±n/a nM
Citation
 PubChem, PC Dose response counterscreen assay for STAT3 activators: cell-based high throughput assay to measure STAT1 activation PubChem Bioassay (2008)[AID] 
Target
Name:
Signal transducer and activator of transcription 1-alpha/beta
Synonyms:
STAT1 Signal transducer and activator of transcription 1-alpha/beta Transcription factor ISGF-3 components p91/p84 | signal transducer and activator of transcription 1 isoform alpha
Type:
Cytosolic Transcription Factor
Mol. Mass.:
87327.69
Organism:
Homo sapiens (Human)
Description:
Stat1 was expressed in sf9 cells from a baculovirus encoding the recombinant proteins. Stat1 dimer binds to DNA.
Residue:
750
  
Inhibitor
Name:
BDBM43627
Synonyms:
5-[(5-keto-3-methyl-1-phenyl-3-pyrazolin-4-yl)methylene]barbituric acid 5-[(5-methyl-3-oxo-2-phenyl-1H-pyrazol-4-yl)methylidene]-1,3-diazinane-2,4,6-trione SMR000273222 | cid_5341318
Type:
Small organic molecule
Emp. Form.:
C15H12N4O4
Mol. Mass.:
312.2802
SMILES:
Cc1[nH]n(-c2ccccc2)c(=O)c1C=C1C(=O)NC(=O)NC1=O
: