Target
Wee1-like protein kinase
Ligand
BDBM43759
Substrate
Meas. Tech.
Dose Response Cell-based Assay for Inhibitors of Wee1 Degradation
EC50
>49750±n/a nM
Citation
 PubChem, PC Dose Response Cell-based Assay for Inhibitors of Wee1 Degradation PubChem Bioassay (2008)[AID] 
Target
Name:
Wee1-like protein kinase
Synonyms:
Serine/threonine-protein kinase WEE1 WEE1 homolog (S. pombe) | WEE1_HUMAN
Type:
PROTEIN
Mol. Mass.:
71599.12
Organism:
Homo sapiens (Human)
Description:
ChEMBL_1445054
Residue:
646
  
Inhibitor
Name:
BDBM43759
Synonyms:
MLS000520448 N-(thiophen-2-ylmethyl)-3-(3,4,5-trimethoxyphenyl)-4,5-dihydro-1,2-oxazole-5-carboxamide SMR000130859 | cid_9551153
Type:
Small organic molecule
Emp. Form.:
C18H20N2O5S
Mol. Mass.:
376.427
SMILES:
COc1cc(cc(OC)c1OC)C1=NOC(C1)C(=O)NCc1cccs1
: