Target
Wee1-like protein kinase
Ligand
BDBM43477
Substrate
Meas. Tech.
Dose Response Cell-based Assay for Inhibitors of Wee1 Degradation
EC50
>1842±n/a nM
Citation
 PubChem, PC Dose Response Cell-based Assay for Inhibitors of Wee1 Degradation PubChem Bioassay (2008)[AID] 
Target
Name:
Wee1-like protein kinase
Synonyms:
Serine/threonine-protein kinase WEE1 WEE1 homolog (S. pombe) | WEE1_HUMAN
Type:
PROTEIN
Mol. Mass.:
71599.12
Organism:
Homo sapiens (Human)
Description:
ChEMBL_1445054
Residue:
646
  
Inhibitor
Name:
BDBM43477
Synonyms:
1,4-Pentadien-3-one, 1,5-di-3-pyridyl- 1,5-bis(3-pyridyl)penta-1,4-dien-3-one MLS000766145 cid_288321
Type:
Small organic molecule
Emp. Form.:
C15H12N2O
Mol. Mass.:
236.2686
SMILES:
O=C(C=Cc1cccnc1)C=Cc1cccnc1
: