Target
Phosphotransferase
Ligand
BDBM43833
Substrate
Meas. Tech.
Inhibition Assay
Temperature
298.15±0 K
Ki
8e+3± 2e+2 nM
IC50
2000000±0.0 nM
Citation
 Willson, MSanejouand, YHPerie, JHannaert, VOpperdoes, F Sequencing, modeling, and selective inhibition of Trypanosoma brucei hexokinase. Chem Biol 9:839-47 (2002)  
Target
Name:
Phosphotransferase
Synonyms:
Hexokinase
Type:
Protein
Mol. Mass.:
51306.14
Organism:
Trypanosoma brucei
Description:
Q38C42
Residue:
471
  
Inhibitor
Name:
BDBM43833
Synonyms:
2-hydroxy-N''''-(3-keto-5,5-dimethyl-cyclohexen-1-yl)benzohydrazide 2-hydroxy-N'-(3-keto-5,5-dimethyl-cyclohexen-1-yl)benzohydrazide MLS000576033 N''''-(5,5-dimethyl-3-oxidanylidene-cyclohexen-1-yl)-2-oxidanyl-benzohydrazide N''''-(5,5-dimethyl-3-oxocyclohexen-1-yl)-2-hydroxybenzohydrazide cid_749340
Type:
Small organic molecule
Emp. Form.:
C15H18N2O3
Mol. Mass.:
274.315
SMILES:
CC1(C)CC(=O)C=C(C1)NNC(=O)c1ccccc1O
: