Target
Glycylpeptide N-tetradecanoyltransferase
Ligand
BDBM43856
Substrate
Meas. Tech.
Inhibition Assay
Ki
1.1e+2±n/a nM
Citation
 Sogabe, SMasubuchi, MSakata, KFukami, TAMorikami, KShiratori, YEbiike, HKawasaki, KAoki, YShimma, ND'Arcy, AWinkler, FKBanner, DWOhtsuka, T Crystal structures of Candida albicans N-myristoyltransferase with two distinct inhibitors. Chem Biol 9:1119-28 (2002)  
Target
Name:
Glycylpeptide N-tetradecanoyltransferase
Synonyms:
2.3.1.97 Myristoyl-CoA:protein N-myristoyltransferase Myristoyl-CoA:protein N-myristoyltransferase (Nmt D112A)) Myristoyl-CoA:protein N-myristoyltransferase (Nmt F115A)) Myristoyl-CoA:protein N-myristoyltransferase (Nmt F240A)) Myristoyl-CoA:protein N-myristoyltransferase (Nmt F339S)) Myristoyl-CoA:protein N-myristoyltransferase (Nmt H227A)) Myristoyl-CoA:protein N-myristoyltransferase (Nmt I352A)) Myristoyl-CoA:protein N-myristoyltransferase (Nmt L451A)) Myristoyl-CoA:protein N-myristoyltransferase (Nmt N175A)) Myristoyl-CoA:protein N-myristoyltransferase (Nmt S241A)) Myristoyl-CoA:protein N-myristoyltransferase (Nmt T211A)) Myristoyl-CoA:protein N-myristoyltransferase (Nmt W232A)) Myristoyl-CoA:protein N-myristoyltransferase (Nmt Y119A)) Myristoyl-CoA:protein N-myristoyltransferase (Nmt Y256A)) Myristoyl-CoA:protein N-myristoyltransferase (Nmt) NMT1 Peptide N-myristoyltransferase | Peptide N-myristoyltransferase 1
Type:
Enzyme
Mol. Mass.:
51875.96
Organism:
Candida albicans (Yeast)
Description:
P30418
Residue:
451
  
Inhibitor
Name:
BDBM43856
Synonyms:
4-ethoxy-N-[(6-fluoro-1,1-diketo-2,3-dihydrothiochromen-4-ylidene)amino]benzenesulfonamide 4-ethoxy-N-[(6-fluoro-1,1-dioxo-2,3-dihydrothiochromen-4-ylidene)amino]benzenesulfonamide MLS000761277 SMR000369580 | cid_3596078
Type:
Small organic molecule
Emp. Form.:
C17H17FN2O5S2
Mol. Mass.:
412.456
SMILES:
CCOc1ccc(cc1)S(=O)(=O)NN=C1CCS(=O)(=O)c2ccc(F)cc12
: