Target
Solute carrier family 12 member 5
Ligand
BDBM43903
Substrate
Meas. Tech.
Identification of Novel Modulators of Cl- dependent Transport Process via HTS; Dose-dependent Assay with KCC2
EC50
0.11±n/a nM
Citation
 PubChem, PC Identification of Novel Modulators of Cl- dependent Transport Process via HTS; Dose-dependent Assay with KCC2 PubChem Bioassay (2009)[AID] 
Target
Name:
Solute carrier family 12 member 5
Synonyms:
Electroneutral potassium-chloride cotransporter 2 KCC2 Neuronal K-Cl cotransporter SLC12A5 electroneutral potassium-chloride cotransporter KCC2 | hKCC2
Type:
PROTEIN
Mol. Mass.:
126185.18
Organism:
Homo sapiens (Human)
Description:
ChEMBL_828024
Residue:
1139
  
Inhibitor
Name:
BDBM43903
Synonyms:
6-amino-3-methyl-5-[1-oxo-2-[[5-(phenylmethyl)-1,3,4-oxadiazol-2-yl]thio]ethyl]-1-propylpyrimidine-2,4-dione 6-amino-5-[2-[(5-benzyl-1,3,4-oxadiazol-2-yl)thio]acetyl]-3-methyl-1-propyl-pyrimidine-2,4-quinone VU0190420-2-D20 | cid_2548302
Type:
Small organic molecule
Emp. Form.:
C19H21N5O4S
Mol. Mass.:
415.466
SMILES:
CCCn1c(N)c(C(=O)CSc2nnc(Cc3ccccc3)o2)c(=O)n(C)c1=O
: