Target
Solute carrier family 12 member 5
Ligand
BDBM43973
Substrate
Meas. Tech.
Identification of Novel Modulators of Cl- dependent Transport Process via HTS; Dose-dependent Assay with KCC2
EC50
7340±n/a nM
Citation
 PubChem, PC Identification of Novel Modulators of Cl- dependent Transport Process via HTS; Dose-dependent Assay with KCC2 PubChem Bioassay (2009)[AID] 
Target
Name:
Solute carrier family 12 member 5
Synonyms:
Electroneutral potassium-chloride cotransporter 2 KCC2 Neuronal K-Cl cotransporter SLC12A5 electroneutral potassium-chloride cotransporter KCC2 | hKCC2
Type:
PROTEIN
Mol. Mass.:
126185.18
Organism:
Homo sapiens (Human)
Description:
ChEMBL_828024
Residue:
1139
  
Inhibitor
Name:
BDBM43973
Synonyms:
MLS000102716 N-[2-(2-phenyl-4-thiazolyl)ethyl]-2-thiophenecarboxamide SMR000018197 | cid_5310230
Type:
Small organic molecule
Emp. Form.:
C16H14N2OS2
Mol. Mass.:
314.425
SMILES:
O=C(NCCc1csc(n1)-c1ccccc1)c1cccs1
: