Target
Heat shock protein HSP 90-alpha
Ligand
BDBM265035
Substrate
Meas. Tech.
Malachite Green ATPase assay
IC50
>10000±n/a nM
Citation
 Drysdale, MJDymock, BWFinch, HWebb, PMcDonald, EJames, KECheung, KMMatthews, TP Isoxazole compounds as inhibitors of heat shock proteins US Patent  US9718793 Publication Date 8/1/2017 
Target
Name:
Heat shock protein HSP 90-alpha
Synonyms:
HS90A_HUMAN HSP86 HSP90AA1 HSPCA Heat shock 86 kDa Heat shock protein HSP 90-alpha (HSP90) LAP-2 Lipopolysaccharide-associated protein 2 heat shock protein 90kDa alpha (cytosolic), class A member 1 isoform 2
Type:
Molecular Chaperone
Mol. Mass.:
84623.45
Organism:
Homo sapiens (Human)
Description:
P07900
Residue:
732
  
Inhibitor
Name:
BDBM265035
Synonyms:
US10413550, Example 7 US9718793, 7
Type:
Small organic molecule
Emp. Form.:
C17H13NO4
Mol. Mass.:
295.2894
SMILES:
Oc1ccccc1-c1oncc1-c1ccc2OCCOc2c1
: