Target
Heat shock protein HSP 90-alpha
Ligand
BDBM265215
Substrate
Meas. Tech.
Fluorescence Polarization Assay
IC50
<10000±n/a nM
Citation
 Drysdale, MJDymock, BWFinch, HWebb, PMcDonald, EJames, KECheung, KMMatthews, TP Isoxazole compounds as inhibitors of heat shock proteins US Patent  US9718793 Publication Date 8/1/2017 
Target
Name:
Heat shock protein HSP 90-alpha
Synonyms:
HS90A_HUMAN HSP86 HSP90AA1 HSPCA Heat shock 86 kDa Heat shock protein HSP 90-alpha (HSP90) LAP-2 Lipopolysaccharide-associated protein 2 heat shock protein 90kDa alpha (cytosolic), class A member 1 isoform 2
Type:
Molecular Chaperone
Mol. Mass.:
84623.45
Organism:
Homo sapiens (Human)
Description:
P07900
Residue:
732
  
Inhibitor
Name:
BDBM265215
Synonyms:
US10413550, Example 41m US9718793, 41m
Type:
Small organic molecule
Emp. Form.:
C23H24ClN3O5
Mol. Mass.:
457.907
SMILES:
CCNC(=O)c1noc(c1-c1ccccc1CN1CCOCC1)-c1cc(Cl)c(O)cc1O
: