Target
E3 ubiquitin-protein ligase XIAP
Ligand
BDBM44257
Substrate
Meas. Tech.
SAR analysis of Antagonists of IAP-family anti-apoptotic proteins
IC50
3900±1700 nM
Citation
 PubChem, PC SAR analysis of Antagonists of IAP-family anti-apoptotic proteins PubChem Bioassay (2009)[AID] 
Target
Name:
E3 ubiquitin-protein ligase XIAP
Synonyms:
API3 E3 ubiquitin-protein ligase XIAP Inhibitor of apoptosis protein 3 X-linked inhibitor of apoptosis XIAP | XIAP_HUMAN
Type:
Protein
Mol. Mass.:
56685.27
Organism:
Homo sapiens (Human)
Description:
P98170
Residue:
497
  
Inhibitor
Name:
BDBM44257
Synonyms:
MLS-0390899.0001 N-(diphenylmethyl)-1-[3-methyl-2-[[2-(methylamino)-1-oxopropyl]amino]-1-oxobutyl]-2-pyrrolidinecarboxamide;2,2,2-trifluoroacetic acid cid_25199549
Type:
Small organic molecule
Emp. Form.:
C27H36N4O3
Mol. Mass.:
464.5997
SMILES:
CNC(C)C(=O)NC(C(C)C)C(=O)N1CCCC1C(=O)NC(c1ccccc1)c1ccccc1
: