Target
E3 ubiquitin-protein ligase XIAP
Ligand
BDBM44356
Substrate
Meas. Tech.
SAR analysis of Antagonists of IAP-family anti-apoptotic proteins
IC50
26800±2900 nM
Citation
 PubChem, PC SAR analysis of Antagonists of IAP-family anti-apoptotic proteins PubChem Bioassay (2009)[AID] 
Target
Name:
E3 ubiquitin-protein ligase XIAP
Synonyms:
API3 E3 ubiquitin-protein ligase XIAP Inhibitor of apoptosis protein 3 X-linked inhibitor of apoptosis XIAP | XIAP_HUMAN
Type:
Protein
Mol. Mass.:
56685.27
Organism:
Homo sapiens (Human)
Description:
P98170
Residue:
497
  
Inhibitor
Name:
BDBM44356
Synonyms:
MLS-0425212.0001 formic acid;(2S)-2-[[(2S)-3-methyl-2-[[(2S)-2-(methylamino)-1-oxopropyl]amino]-1-oxobutyl]amino]-N-(1-naphthalenyl)pentanediamide formic acid;(2S)-2-[[(2S)-3-methyl-2-[[(2S)-2-(methylamino)propanoyl]amino]butanoyl]amino]-N-naphthalen-1-ylpentanediamide | methanoic acid;(2S)-2-[[(2S)-3-methyl-2-[[(2S)-2-(methylamino)propanoyl]amino]butanoyl]amino]-N-naphthalen-1-yl-pentanediamide
Type:
Small organic molecule
Emp. Form.:
C24H33N5O4
Mol. Mass.:
455.5499
SMILES:
CN[C@@H](C)C(=O)N[C@@H](C(C)C)C(=O)N[C@@H](CCC(N)=O)C(=O)Nc1cccc2ccccc12
: