Target
Ephrin type-A receptor 4
Ligand
BDBM38802
Substrate
Meas. Tech.
Colorimetric assay for HTS discovery of chemical inhibitors of EphA4 receptor antagonists
IC50
300±n/a nM
Citation
 PubChem, PC Colorimetric assay for HTS discovery of chemical inhibitors of EphA4 receptor antagonists PubChem Bioassay (2008)[AID] 
Target
Name:
Ephrin type-A receptor 4
Synonyms:
EPHA4_MOUSE Epha4 Sek1
Type:
Enzyme Catalytic Domain
Mol. Mass.:
109812.17
Organism:
Mus musculus
Description:
gi_34328113
Residue:
986
  
Inhibitor
Name:
BDBM38802
Synonyms:
MLS000038842 cid_659226
Type:
Small organic molecule
Emp. Form.:
C21H16BrNO6
Mol. Mass.:
458.259
SMILES:
CCOC(=O)C(C(=O)OCC)c1cc(Br)c2noc3-c4ccccc4C(=O)c1c23
: