Target
Ephrin type-A receptor 4
Ligand
BDBM34172
Substrate
Meas. Tech.
Colorimetric assay for HTS discovery of chemical inhibitors of EphA4 receptor antagonists
IC50
4100±n/a nM
Citation
 PubChem, PC Colorimetric assay for HTS discovery of chemical inhibitors of EphA4 receptor antagonists PubChem Bioassay (2008)[AID] 
Target
Name:
Ephrin type-A receptor 4
Synonyms:
EPHA4_MOUSE Epha4 Sek1
Type:
Enzyme Catalytic Domain
Mol. Mass.:
109812.17
Organism:
Mus musculus
Description:
gi_34328113
Residue:
986
  
Inhibitor
Name:
BDBM34172
Synonyms:
MLS000038673 N-(5-ethylsulfanyl-1,3,4-thiadiazol-2-yl)-3,3,3-tris(fluoranyl)-2-(trifluoromethyl)propanamide N-[5-(ethylthio)-1,3,4-thiadiazol-2-yl]-3,3,3-trifluoro-2-(trifluoromethyl)propionamide cid_659575
Type:
Small organic molecule
Emp. Form.:
C8H7F6N3OS2
Mol. Mass.:
339.281
SMILES:
CCSc1nnc(NC(=O)C(C(F)(F)F)C(F)(F)F)s1
: