Target
Ephrin type-A receptor 4
Ligand
BDBM44433
Substrate
Meas. Tech.
Colorimetric assay for HTS discovery of chemical inhibitors of EphA4 receptor antagonists
IC50
>100000±n/a nM
Citation
 PubChem, PC Colorimetric assay for HTS discovery of chemical inhibitors of EphA4 receptor antagonists PubChem Bioassay (2008)[AID] 
Target
Name:
Ephrin type-A receptor 4
Synonyms:
EPHA4_MOUSE Epha4 Sek1
Type:
Enzyme Catalytic Domain
Mol. Mass.:
109812.17
Organism:
Mus musculus
Description:
gi_34328113
Residue:
986
  
Inhibitor
Name:
BDBM44433
Synonyms:
2-cyano-2-[3-(4-ethyl-1-piperazinyl)-2-quinoxalinyl]acetic acid hexyl ester MLS000040227 cid_662260 hexyl 2-cyano-2-[3-(4-ethylpiperazin-1-yl)quinoxalin-2-yl]ethanoate
Type:
Small organic molecule
Emp. Form.:
C23H31N5O2
Mol. Mass.:
409.5245
SMILES:
CCCCCCOC(=O)C(C#N)c1nc2ccccc2nc1N1CCN(CC)CC1
: