Target
Ephrin type-A receptor 4
Ligand
BDBM44466
Substrate
Meas. Tech.
Colorimetric assay for HTS discovery of chemical inhibitors of EphA4 receptor antagonists
IC50
3450±n/a nM
Citation
 PubChem, PC Colorimetric assay for HTS discovery of chemical inhibitors of EphA4 receptor antagonists PubChem Bioassay (2008)[AID] 
Target
Name:
Ephrin type-A receptor 4
Synonyms:
EPHA4_MOUSE Epha4 Sek1
Type:
Enzyme Catalytic Domain
Mol. Mass.:
109812.17
Organism:
Mus musculus
Description:
gi_34328113
Residue:
986
  
Inhibitor
Name:
BDBM44466
Synonyms:
(5Z)-3-(5-chloranyl-2-methyl-phenyl)-2-methyl-5-[(4-nitrophenyl)methylidene]imidazol-4-one (5Z)-3-(5-chloro-2-methylphenyl)-2-methyl-5-[(4-nitrophenyl)methylidene]-4-imidazolone MLS000519000 cid_9550811
Type:
Small organic molecule
Emp. Form.:
C18H14ClN3O3
Mol. Mass.:
355.775
SMILES:
Cc1ccc(Cl)cc1-n1c([CH2-])nc([CH+]c2ccc(cc2)[N+]([O-])=O)c1O
: