Target
Ephrin type-A receptor 4
Ligand
BDBM44468
Substrate
Meas. Tech.
Colorimetric assay for HTS discovery of chemical inhibitors of EphA4 receptor antagonists
IC50
>100000±n/a nM
Citation
 PubChem, PC Colorimetric assay for HTS discovery of chemical inhibitors of EphA4 receptor antagonists PubChem Bioassay (2008)[AID] 
Target
Name:
Ephrin type-A receptor 4
Synonyms:
EPHA4_MOUSE Epha4 Sek1
Type:
Enzyme Catalytic Domain
Mol. Mass.:
109812.17
Organism:
Mus musculus
Description:
gi_34328113
Residue:
986
  
Inhibitor
Name:
BDBM44468
Synonyms:
2-[3-[(4-chlorophenyl)methyl]-6,7-dimethoxy-4-oxidanylidene-quinazolin-2-yl]sulfanyl-N,N-diethyl-ethanamide 2-[[3-(4-chlorobenzyl)-4-keto-6,7-dimethoxy-quinazolin-2-yl]thio]-N,N-diethyl-acetamide MLS000520816 cid_4243378
Type:
Small organic molecule
Emp. Form.:
C23H26ClN3O4S
Mol. Mass.:
475.988
SMILES:
CCN(CC)C(=O)CSc1nc2cc(OC)c(OC)cc2c(=O)n1Cc1ccc(Cl)cc1
: