Target
Ephrin type-A receptor 4
Ligand
BDBM44480
Substrate
Meas. Tech.
Colorimetric assay for HTS discovery of chemical inhibitors of EphA4 receptor antagonists
IC50
9900±n/a nM
Citation
 PubChem, PC Colorimetric assay for HTS discovery of chemical inhibitors of EphA4 receptor antagonists PubChem Bioassay (2008)[AID] 
Target
Name:
Ephrin type-A receptor 4
Synonyms:
EPHA4_MOUSE Epha4 Sek1
Type:
Enzyme Catalytic Domain
Mol. Mass.:
109812.17
Organism:
Mus musculus
Description:
gi_34328113
Residue:
986
  
Inhibitor
Name:
BDBM44480
Synonyms:
1-(3-Amino-6-thiophen-2-yl-4-trifluoromethyl-thieno[2,3-b]pyridin-2-yl)-2,2-dimethyl-propan-1-one 1-[3-amino-6-thiophen-2-yl-4-(trifluoromethyl)-2-thieno[2,3-b]pyridinyl]-2,2-dimethyl-1-propanone 1-[3-azanyl-6-thiophen-2-yl-4-(trifluoromethyl)thieno[2,3-b]pyridin-2-yl]-2,2-dimethyl-propan-1-one SMR000148880 | cid_1272770
Type:
Small organic molecule
Emp. Form.:
C17H15F3N2OS2
Mol. Mass.:
384.439
SMILES:
CC(C)(C)C(=O)c1sc2nc(cc(c2c1N)C(F)(F)F)-c1cccs1
: