Target
Ephrin type-A receptor 4
Ligand
BDBM44488
Substrate
Meas. Tech.
Colorimetric assay for HTS discovery of chemical inhibitors of EphA4 receptor antagonists
IC50
3570±n/a nM
Citation
 PubChem, PC Colorimetric assay for HTS discovery of chemical inhibitors of EphA4 receptor antagonists PubChem Bioassay (2008)[AID] 
Target
Name:
Ephrin type-A receptor 4
Synonyms:
EPHA4_MOUSE Epha4 Sek1
Type:
Enzyme Catalytic Domain
Mol. Mass.:
109812.17
Organism:
Mus musculus
Description:
gi_34328113
Residue:
986
  
Inhibitor
Name:
BDBM44488
Synonyms:
(5Z)-3-[[3-chloranyl-5-(trifluoromethyl)pyridin-2-yl]amino]-2-sulfanylidene-5-[(3,4,5-trimethoxyphenyl)methylidene]-1,3-thiazolidin-4-one (5Z)-3-[[3-chloro-5-(trifluoromethyl)-2-pyridyl]amino]-2-thioxo-5-(3,4,5-trimethoxybenzylidene)thiazolidin-4-one MLS000565400 cid_2320033
Type:
Small organic molecule
Emp. Form.:
C19H15ClF3N3O4S2
Mol. Mass.:
505.918
SMILES:
COc1cc(C=C2SC(=S)N(Nc3ncc(cc3Cl)C(F)(F)F)C2=O)cc(OC)c1OC
: