Target
Ephrin type-A receptor 4
Ligand
BDBM44489
Substrate
Meas. Tech.
Colorimetric assay for HTS discovery of chemical inhibitors of EphA4 receptor antagonists
IC50
3580±n/a nM
Citation
 PubChem, PC Colorimetric assay for HTS discovery of chemical inhibitors of EphA4 receptor antagonists PubChem Bioassay (2008)[AID] 
Target
Name:
Ephrin type-A receptor 4
Synonyms:
EPHA4_MOUSE Epha4 Sek1
Type:
Enzyme Catalytic Domain
Mol. Mass.:
109812.17
Organism:
Mus musculus
Description:
gi_34328113
Residue:
986
  
Inhibitor
Name:
BDBM44489
Synonyms:
5-hydroxy-2-methyl-4-[4-morpholinyl(3-pyridinyl)methyl]-3-benzo[g]benzofurancarboxylic acid ethyl ester MLS000566244 cid_3313092 ethyl 5-hydroxy-2-methyl-4-[morpholin-4-yl(pyridin-3-yl)methyl]benzo[g][1]benzofuran-3-carboxylate
Type:
Small organic molecule
Emp. Form.:
C26H26N2O5
Mol. Mass.:
446.495
SMILES:
CCOC(=O)c1c(C)oc2c1c(C(N1CCOCC1)c1cccnc1)c(O)c1ccccc21
: