Target
Ephrin type-A receptor 4
Ligand
BDBM44531
Substrate
Meas. Tech.
Colorimetric assay for HTS discovery of chemical inhibitors of EphA4 receptor antagonists
IC50
5140±n/a nM
Citation
 PubChem, PC Colorimetric assay for HTS discovery of chemical inhibitors of EphA4 receptor antagonists PubChem Bioassay (2008)[AID] 
Target
Name:
Ephrin type-A receptor 4
Synonyms:
EPHA4_MOUSE Epha4 Sek1
Type:
Enzyme Catalytic Domain
Mol. Mass.:
109812.17
Organism:
Mus musculus
Description:
gi_34328113
Residue:
986
  
Inhibitor
Name:
BDBM44531
Synonyms:
5-[(1-cyclohexyl-2,5-dimethyl-1H-pyrrol-3-yl)methylene]-1,3-dimethyl-2-thioxodihydro-4,6(1H,5H)-pyrimidinedione 5-[(1-cyclohexyl-2,5-dimethyl-pyrrol-3-yl)methylene]-1,3-dimethyl-2-thioxo-hexahydropyrimidine-4,6-quinone 5-[(1-cyclohexyl-2,5-dimethylpyrrol-3-yl)methylidene]-1,3-dimethyl-2-sulfanylidene-1,3-diazinane-4,6-dione SMR000194712 | cid_1347165
Type:
Small organic molecule
Emp. Form.:
C19H25N3O2S
Mol. Mass.:
359.486
SMILES:
[#6]-[#7]-1-[#6](=S)-[#7](-[#6])-[#6](=O)\[#6](=[#6]/c2cc(-[#6])n(-[#6]-3-[#6]-[#6]-[#6]-[#6]-[#6]-3)c2-[#6])-[#6]-1=O
: