Target
Ephrin type-A receptor 4
Ligand
BDBM35501
Substrate
Meas. Tech.
Counter Screen for Placental Alkaline Phosphatase-based Assays Positives
IC50
>50000±0 nM
Citation
 PubChem, PC Counter Screen for Placental Alkaline Phosphatase-based Assays Positives PubChem Bioassay (2008)[AID] 
Target
Name:
Ephrin type-A receptor 4
Synonyms:
EPHA4_MOUSE Epha4 Sek1
Type:
Enzyme Catalytic Domain
Mol. Mass.:
109812.17
Organism:
Mus musculus
Description:
gi_34328113
Residue:
986
  
Inhibitor
Name:
BDBM35501
Synonyms:
4-[2,3-bis(2-furyl)quinoxalin-6-yl]sulfonylmorpholine 4-[[2,3-bis(2-furanyl)-6-quinoxalinyl]sulfonyl]morpholine SMR000066141 | cid_2338527
Type:
Small organic molecule
Emp. Form.:
C20H17N3O5S
Mol. Mass.:
411.431
SMILES:
O=S(=O)(N1CCOCC1)c1ccc2nc(-c3ccco3)c(nc2c1)-c1ccco1
: