Target
Ephrin type-A receptor 4
Ligand
BDBM44467
Substrate
Meas. Tech.
Counter Screen for Placental Alkaline Phosphatase-based Assays Positives
IC50
>50000±0 nM
Citation
 PubChem, PC Counter Screen for Placental Alkaline Phosphatase-based Assays Positives PubChem Bioassay (2008)[AID] 
Target
Name:
Ephrin type-A receptor 4
Synonyms:
EPHA4_MOUSE Epha4 Sek1
Type:
Enzyme Catalytic Domain
Mol. Mass.:
109812.17
Organism:
Mus musculus
Description:
gi_34328113
Residue:
986
  
Inhibitor
Name:
BDBM44467
Synonyms:
MLS000531830 N-(4-methoxyphenyl)-N-(2,4,5-trichlorophenyl)sulfonyl-2-furancarboxamide N-(4-methoxyphenyl)-N-[(2,4,5-trichlorophenyl)sulfonyl]-2-furamide SMR000136809 | cid_2963533
Type:
Small organic molecule
Emp. Form.:
C18H12Cl3NO5S
Mol. Mass.:
460.716
SMILES:
COc1ccc(cc1)N(C(=O)c1ccco1)S(=O)(=O)c1cc(Cl)c(Cl)cc1Cl
: