Target
Ephrin type-A receptor 4
Ligand
BDBM41075
Substrate
Meas. Tech.
Counter Screen for Placental Alkaline Phosphatase-based Assays Positives
IC50
>50000±0 nM
Citation
 PubChem, PC Counter Screen for Placental Alkaline Phosphatase-based Assays Positives PubChem Bioassay (2008)[AID] 
Target
Name:
Ephrin type-A receptor 4
Synonyms:
EPHA4_MOUSE Epha4 Sek1
Type:
Enzyme Catalytic Domain
Mol. Mass.:
109812.17
Organism:
Mus musculus
Description:
gi_34328113
Residue:
986
  
Inhibitor
Name:
BDBM41075
Synonyms:
2-(N-(4-ethoxyphenyl)sulfonylanilino)-N-[[5-(4-nitrophenyl)-2-furanyl]methylideneamino]acetamide 2-[(4-ethoxyphenyl)sulfonyl-phenyl-amino]-N-[[5-(4-nitrophenyl)furan-2-yl]methylideneamino]ethanamide MLS000539722 SMR000162037 | cid_1743666
Type:
Small organic molecule
Emp. Form.:
C27H24N4O7S
Mol. Mass.:
548.567
SMILES:
CCOc1ccc(cc1)S(=O)(=O)N(CC(=O)N\N=C\c1ccc(o1)-c1ccc(cc1)[N+]([O-])=O)c1ccccc1
: