Target
Sphingosine 1-phosphate receptor 2
Ligand
BDBM41674
Substrate
Meas. Tech.
Counter screen for S1P2 Agonists: Dose Response High Throughput Cell-Based Screen to Identify Activators of CRE-BLA
EC50
>50000±n/a nM
Citation
 PubChem, PC Counter screen for S1P2 Agonists: Dose Response High Throughput Cell-Based Screen to Identify Activators of CRE-BLA PubChem Bioassay (2007)[AID] 
Target
Name:
Sphingosine 1-phosphate receptor 2
Synonyms:
EDG5 S1PR2 Sphingosine 1-phosphate receptor Sphingosine-1-phosphate receptor 2 | ndothelial differentiation G-protein coupled receptor 5
Type:
G Protein-Coupled Receptor (GPCR)
Mol. Mass.:
38883.16
Organism:
Homo sapiens (Human)
Description:
Membranes isolated from S1P2-transfected CHO cells were used in ligand binding assay.
Residue:
353
  
Inhibitor
Name:
BDBM41674
Synonyms:
2-(3,4-Dihydro-1H-isoquinolin-2-yl)-7-p-tolyl-7,8-dihydro-6H-quinazolin-5-one 2-(3,4-dihydro-1H-isoquinolin-2-yl)-7-(p-tolyl)-7,8-dihydro-6H-quinazolin-5-one SMR000148546 | cid_4563710
Type:
Small organic molecule
Emp. Form.:
C24H23N3O
Mol. Mass.:
369.4589
SMILES:
Cc1ccc(cc1)C1CC(=O)c2cnc(nc2C1)N1CCc2ccccc2C1
: