Target
Sphingosine 1-phosphate receptor 2
Ligand
BDBM41676
Substrate
Meas. Tech.
Counter screen for S1P2 Agonists: Dose Response High Throughput Cell-Based Screen to Identify Activators of CRE-BLA
EC50
5895±n/a nM
Citation
 PubChem, PC Counter screen for S1P2 Agonists: Dose Response High Throughput Cell-Based Screen to Identify Activators of CRE-BLA PubChem Bioassay (2007)[AID] 
Target
Name:
Sphingosine 1-phosphate receptor 2
Synonyms:
EDG5 S1PR2 Sphingosine 1-phosphate receptor Sphingosine-1-phosphate receptor 2 | ndothelial differentiation G-protein coupled receptor 5
Type:
G Protein-Coupled Receptor (GPCR)
Mol. Mass.:
38883.16
Organism:
Homo sapiens (Human)
Description:
Membranes isolated from S1P2-transfected CHO cells were used in ligand binding assay.
Residue:
353
  
Inhibitor
Name:
BDBM41676
Synonyms:
2-Amino-1-thiophen-2-ylmethyl-1H-pyrrolo[2,3-b]quinoxaline-3-carboxylic acid (3-phenyl-propyl)-amide 2-amino-N-(3-phenylpropyl)-1-(thiophen-2-ylmethyl)-3-pyrrolo[3,2-b]quinoxalinecarboxamide 2-azanyl-N-(3-phenylpropyl)-1-(thiophen-2-ylmethyl)pyrrolo[3,2-b]quinoxaline-3-carboxamide SMR000148653 | cid_2016176
Type:
Small organic molecule
Emp. Form.:
C25H23N5OS
Mol. Mass.:
441.548
SMILES:
Nc1c(C(=O)NCCCc2ccccc2)c2nc3ccccc3nc2n1Cc1cccs1
: