Target
Multidrug resistance-associated protein 1
Ligand
BDBM44584
Substrate
Meas. Tech.
Identification of Molecular Probes that Activate MRP-1 - Dose Response
EC50
6824±n/a nM
Citation
 PubChem, PC Identification of Molecular Probes that Activate MRP-1 - Dose Response PubChem Bioassay (2007)[AID] 
Target
Name:
Multidrug resistance-associated protein 1
Synonyms:
7.6.2.2 ABCC1 ATP-binding cassette, sub-family C, member 1 isoform 1 LTC4 transporter MRP MRP1_HUMAN
Type:
Mol. Mass.:
171597.72
Organism:
Homo sapiens (Human)
Description:
P33527
Residue:
1531
  
Inhibitor
Name:
BDBM44584
Synonyms:
3-(2,6-dimethyl-4-oxidanylidene-5-phenyl-pyrimidin-1-yl)benzoic acid 3-(2,6-dimethyl-4-oxo-5-phenylpyrimidin-1-yl)benzoic acid MLS000080036 cid_658372
Type:
Small organic molecule
Emp. Form.:
C19H16N2O3
Mol. Mass.:
320.3419
SMILES:
Cc1nc(=O)c(c(C)n1-c1cccc(c1)C(O)=O)-c1ccccc1
: