Target
Multidrug resistance-associated protein 1
Ligand
BDBM44621
Substrate
Meas. Tech.
Identification of Molecular Probes that Activate MRP-1 - Dose Response
EC50
7875±n/a nM
Citation
 PubChem, PC Identification of Molecular Probes that Activate MRP-1 - Dose Response PubChem Bioassay (2007)[AID] 
Target
Name:
Multidrug resistance-associated protein 1
Synonyms:
7.6.2.2 ABCC1 ATP-binding cassette, sub-family C, member 1 isoform 1 LTC4 transporter MRP MRP1_HUMAN
Type:
Mol. Mass.:
171597.72
Organism:
Homo sapiens (Human)
Description:
P33527
Residue:
1531
  
Inhibitor
Name:
BDBM44621
Synonyms:
(1S,3R,3aR,6aS)-5-(4-fluorophenyl)-1-(4-hydroxybenzyl)spiro[1,2,3a,6a-tetrahydropyrrolo[3,4-c]pyrrole-3,3'-indoline]-2',4,6-trione MLS000042296 cid_5390035
Type:
Small organic molecule
Emp. Form.:
C26H20FN3O4
Mol. Mass.:
457.4531
SMILES:
Oc1c2[C@H](Cc3ccc(O)cc3)N[C@]3(C(=O)Nc4ccccc34)c2c(O)n1-c1ccc(F)cc1
: