Target
Multidrug resistance-associated protein 1
Ligand
BDBM44713
Substrate
Meas. Tech.
Identification of Molecular Probes that Activate MRP-1 - Dose Response
EC50
5600±n/a nM
Citation
 PubChem, PC Identification of Molecular Probes that Activate MRP-1 - Dose Response PubChem Bioassay (2007)[AID] 
Target
Name:
Multidrug resistance-associated protein 1
Synonyms:
7.6.2.2 ABCC1 ATP-binding cassette, sub-family C, member 1 isoform 1 LTC4 transporter MRP MRP1_HUMAN
Type:
Mol. Mass.:
171597.72
Organism:
Homo sapiens (Human)
Description:
P33527
Residue:
1531
  
Inhibitor
Name:
BDBM44713
Synonyms:
1-[5-[(E)-2-(dimethylamino)vinyl]-3-methyl-isoxazol-4-yl]sulfonyl-N-(2-furfuryl)nipecotamide 1-[[5-[(E)-2-(dimethylamino)ethenyl]-3-methyl-4-isoxazolyl]sulfonyl]-N-(2-furanylmethyl)-3-piperidinecarboxamide SMR000095761 | cid_5308063
Type:
Small organic molecule
Emp. Form.:
C19H26N4O5S
Mol. Mass.:
422.499
SMILES:
CN(C)\C=C\c1onc(C)c1S(=O)(=O)N1CCCC(C1)C(=O)NCc1ccco1
: