Target
Multidrug resistance-associated protein 1
Ligand
BDBM41416
Substrate
Meas. Tech.
Identification of Molecular Probes that Activate MRP-1 - Dose Response
EC50
10556±n/a nM
Citation
 PubChem, PC Identification of Molecular Probes that Activate MRP-1 - Dose Response PubChem Bioassay (2007)[AID] 
Target
Name:
Multidrug resistance-associated protein 1
Synonyms:
7.6.2.2 ABCC1 ATP-binding cassette, sub-family C, member 1 isoform 1 LTC4 transporter MRP MRP1_HUMAN
Type:
Mol. Mass.:
171597.72
Organism:
Homo sapiens (Human)
Description:
P33527
Residue:
1531
  
Inhibitor
Name:
BDBM41416
Synonyms:
MLS000116424 N-[3,5-dimethyl-1-[(2-methylphenyl)methyl]-4-pyrazolyl]-4,5-dihydrobenzo[g][1,2]benzoxazole-3-carboxamide SMR000093401 | cid_5308876
Type:
Small organic molecule
Emp. Form.:
C25H24N4O2
Mol. Mass.:
412.4837
SMILES:
Cc1nn(Cc2ccccc2C)c(C)c1NC(=O)c1noc-2c1CCc1ccccc-21
: