Target
Multidrug resistance-associated protein 1
Ligand
BDBM44766
Substrate
Meas. Tech.
Identification of Molecular Probes that Activate MRP-1 - Dose Response
EC50
4368±n/a nM
Citation
 PubChem, PC Identification of Molecular Probes that Activate MRP-1 - Dose Response PubChem Bioassay (2007)[AID] 
Target
Name:
Multidrug resistance-associated protein 1
Synonyms:
7.6.2.2 ABCC1 ATP-binding cassette, sub-family C, member 1 isoform 1 LTC4 transporter MRP MRP1_HUMAN
Type:
Mol. Mass.:
171597.72
Organism:
Homo sapiens (Human)
Description:
P33527
Residue:
1531
  
Inhibitor
Name:
BDBM44766
Synonyms:
5-[[4-(2-fluorophenyl)-1-piperazinyl]-(3,4,5-trimethoxyphenyl)methyl]-6-thiazolo[3,2-b][1,2,4]triazolol 5-[[4-(2-fluorophenyl)piperazino]-(3,4,5-trimethoxyphenyl)methyl]thiazolo[3,2-b][1,2,4]triazol-6-ol SMR000017883 | cid_5310247
Type:
Small organic molecule
Emp. Form.:
C24H26FN5O4S
Mol. Mass.:
499.558
SMILES:
COc1cc(cc(OC)c1OC)C(N1CCN(CC1)c1ccccc1F)c1sc2ncnn2c1O
: