Target
Multidrug resistance-associated protein 1
Ligand
BDBM44789
Substrate
Meas. Tech.
Identification of Molecular Probes that Activate MRP-1 - Dose Response
EC50
1434±n/a nM
Citation
 PubChem, PC Identification of Molecular Probes that Activate MRP-1 - Dose Response PubChem Bioassay (2007)[AID] 
Target
Name:
Multidrug resistance-associated protein 1
Synonyms:
7.6.2.2 ABCC1 ATP-binding cassette, sub-family C, member 1 isoform 1 LTC4 transporter MRP MRP1_HUMAN
Type:
Mol. Mass.:
171597.72
Organism:
Homo sapiens (Human)
Description:
P33527
Residue:
1531
  
Inhibitor
Name:
BDBM44789
Synonyms:
(6Z)-3-methoxy-6-[4-(1-phenyl-4-pyrazolyl)-1,2-dihydropyrazol-3-ylidene]-1-cyclohexa-2,4-dienone (6Z)-3-methoxy-6-[4-(1-phenylpyrazol-4-yl)-3-pyrazolin-3-ylidene]cyclohexa-2,4-dien-1-one SMR000107507 | cid_5407898
Type:
Small organic molecule
Emp. Form.:
C19H16N4O2
Mol. Mass.:
332.3559
SMILES:
COc1ccc(-c2n[nH]cc2-c2cnn(c2)-c2ccccc2)c(O)c1
: