Target
Coagulation factor XII
Ligand
BDBM32881
Substrate
Meas. Tech.
Factor XIIa 1536 HTS Dose Response Confirmation
IC50
159.06±63.176598 nM
Citation
 PubChem, PC Factor XIIa 1536 HTS Dose Response Confirmation PubChem Bioassay (2008)[AID] 
Target
Name:
Coagulation factor XII
Synonyms:
Beta-factor XIIa part 1 Carboxylesterase 2 (intestine, liver) Coagulation factor XII (FXII) Coagulation factor XIIa light chain FA12_HUMAN Factor XIIa (fXIIa) Hageman factor
Type:
Enzyme
Mol. Mass.:
67810.07
Organism:
Homo sapiens (Human)
Description:
P00748
Residue:
615
  
Inhibitor
Name:
BDBM32881
Synonyms:
MLS000706208 [3-(2-furanyl)-5-(methylthio)-1,2,4-triazol-1-yl]-(2-methoxyphenyl)methanone [3-(furan-2-yl)-5-methylsulfanyl-1,2,4-triazol-1-yl]-(2-methoxyphenyl)methanone | cid_977140
Type:
Small organic molecule
Emp. Form.:
C15H13N3O3S
Mol. Mass.:
315.347
SMILES:
COc1ccccc1C(=O)n1nc(nc1SC)-c1ccco1
: