Target
Coagulation factor XII
Ligand
BDBM45605
Substrate
Meas. Tech.
Factor XIIa 1536 HTS Dose Response Confirmation
IC50
43.963333±56.363249 nM
Citation
 PubChem, PC Factor XIIa 1536 HTS Dose Response Confirmation PubChem Bioassay (2008)[AID] 
Target
Name:
Coagulation factor XII
Synonyms:
Beta-factor XIIa part 1 Carboxylesterase 2 (intestine, liver) Coagulation factor XII (FXII) Coagulation factor XIIa light chain FA12_HUMAN Factor XIIa (fXIIa) Hageman factor
Type:
Enzyme
Mol. Mass.:
67810.07
Organism:
Homo sapiens (Human)
Description:
P00748
Residue:
615
  
Inhibitor
Name:
BDBM45605
Synonyms:
1-benzoyl-3-(4-methoxyphenyl)-1H-1,2,4-triazol-5-amine SMR000293132 [5-amino-3-(4-methoxyphenyl)-1,2,4-triazol-1-yl]-phenylmethanone cid_753280
Type:
Small organic molecule
Emp. Form.:
C16H14N4O2
Mol. Mass.:
294.308
SMILES:
COc1ccc(cc1)-c1nc(N)n(n1)C(=O)c1ccccc1
: