Target
Coagulation factor XII
Ligand
BDBM45677
Substrate
Meas. Tech.
Factor XIIa 1536 HTS Dose Response Confirmation
IC50
2110.713333±55.311519 nM
Citation
 PubChem, PC Factor XIIa 1536 HTS Dose Response Confirmation PubChem Bioassay (2008)[AID] 
Target
Name:
Coagulation factor XII
Synonyms:
Beta-factor XIIa part 1 Carboxylesterase 2 (intestine, liver) Coagulation factor XII (FXII) Coagulation factor XIIa light chain FA12_HUMAN Factor XIIa (fXIIa) Hageman factor
Type:
Enzyme
Mol. Mass.:
67810.07
Organism:
Homo sapiens (Human)
Description:
P00748
Residue:
615
  
Inhibitor
Name:
BDBM45677
Synonyms:
MLS000771704 N-[5-(trifluoromethyl)-1H-1,2,4-triazol-3-yl]thiophene-2-carboxamide cid_2097024
Type:
Small organic molecule
Emp. Form.:
C8H5F3N4OS
Mol. Mass.:
262.212
SMILES:
FC(F)(F)c1nnc(NC(=O)c2cccs2)[nH]1
: