Target
Sphingosine 1-phosphate receptor 2
Ligand
BDBM36900
Substrate
Meas. Tech.
Counterscreen for S1P2 Antagonists: Dose Response Cell-Based Screen to Identify Antagonists of CRE-BLA
IC50
810±n/a nM
Citation
 PubChem, PC Counterscreen for S1P2 Antagonists: Dose Response Cell-Based Screen to Identify Antagonists of CRE-BLA PubChem Bioassay (2008)[AID] 
Target
Name:
Sphingosine 1-phosphate receptor 2
Synonyms:
EDG5 S1PR2 Sphingosine 1-phosphate receptor Sphingosine-1-phosphate receptor 2 | ndothelial differentiation G-protein coupled receptor 5
Type:
G Protein-Coupled Receptor (GPCR)
Mol. Mass.:
38883.16
Organism:
Homo sapiens (Human)
Description:
Membranes isolated from S1P2-transfected CHO cells were used in ligand binding assay.
Residue:
353
  
Inhibitor
Name:
BDBM36900
Synonyms:
4-[4-(1,3-benzodioxol-5-ylmethyl)-1-piperazinyl]-8-fluoro-5H-pyrimido[5,4-b]indole 4-[4-(1,3-benzodioxol-5-ylmethyl)piperazin-1-yl]-8-fluoro-5H-pyrimido[5,4-b]indole MLS000078398 cid_659623
Type:
Small organic molecule
Emp. Form.:
C22H20FN5O2
Mol. Mass.:
405.4249
SMILES:
Fc1ccc2[nH]c3c(ncnc3c2c1)N1CCN(Cc2ccc3OCOc3c2)CC1
: