Target
Sphingosine 1-phosphate receptor 2
Ligand
BDBM37054
Substrate
Meas. Tech.
Counterscreen for S1P2 Antagonists: Dose Response Cell-Based Screen to Identify Antagonists of CRE-BLA
IC50
4037±n/a nM
Citation
 PubChem, PC Counterscreen for S1P2 Antagonists: Dose Response Cell-Based Screen to Identify Antagonists of CRE-BLA PubChem Bioassay (2008)[AID] 
Target
Name:
Sphingosine 1-phosphate receptor 2
Synonyms:
EDG5 S1PR2 Sphingosine 1-phosphate receptor Sphingosine-1-phosphate receptor 2 | ndothelial differentiation G-protein coupled receptor 5
Type:
G Protein-Coupled Receptor (GPCR)
Mol. Mass.:
38883.16
Organism:
Homo sapiens (Human)
Description:
Membranes isolated from S1P2-transfected CHO cells were used in ligand binding assay.
Residue:
353
  
Inhibitor
Name:
BDBM37054
Synonyms:
3-[(5-chloranyl-1,3-benzoxazol-2-yl)sulfanyl]-1-benzothiophene 1,1-dioxide 3-[(5-chloro-1,3-benzoxazol-2-yl)thio]-1-benzothiophene 1,1-dioxide 5-chloro-2-[(1,1-dioxido-1-benzothien-3-yl)thio]-1,3-benzoxazole SMR000019512 | cid_2928973
Type:
Small organic molecule
Emp. Form.:
C15H8ClNO3S2
Mol. Mass.:
349.812
SMILES:
Clc1ccc2oc(SC3=CS(=O)(=O)c4ccccc34)nc2c1
: